BDBM50222928 CHEMBL273312
SMILES Cn1cc(cn1)-c1ccccc1NCC1=NCCN1
InChI Key InChIKey=KEHDGXFGMIOLCR-UHFFFAOYSA-N
Data  3 EC50
  Tab Delimited (TSV)   2D SDfile   Computed 3D by Vconf -m prep SDfile
Find this compound or compounds like it in BindingDB:
Activity Spreadsheet -- Enzyme Inhibition Constant Data from BindingDB
Found 1 hit for monomerid = 50222928
TargetAlpha-1D adrenergic receptor(Homo sapiens (Human))
Glaxosmithkline
Curated by ChEMBL
LigandPNGBDBM50222928(CHEMBL273312)
Affinity DataEC50: <1.00E+5nM. Assay description: Agonism of recombinant human alpha-1D adrenergic receptor, expressed in rat 1 fibroblast cells
In DepthDetails ArticlePubMed